{"text_format":"1","workbook":"xlsx","n_sheets":6,"sheets":["DATA","KEGIATAN","LAMPIRAN","COVER","BULANAN","HARIAN"],"not_rendered":{"charts":0,"images":7,"macros":1,"external_links":0,"defined_names":6,"comments":0,"pivot_tables":0},"unopened":[],"bounds":{"document_bytes":16777216,"sheet_cells":100000,"rows_first":2000,"rows_last":500,"rows_between":2000,"halvings":0,"cell_chars":16384,"cell_head_chars":4096},"cells_cut":0,"cells_raw":0,"read":"whole","date_system":"1900"}

{"sheet":"DATA","index":0,"n_rows":37,"n_cols":14,"rows_kept":37,"cut":false,"hidden":false,"merged":[[1,1,1,3],[9,1,9,3],[15,9,15,13]]}
[]
[null,"DATA PEJABAT PENILAI"]
[null,"NAMA","H. ENJANG, S.Ag., M.Pd.I."]
[null,"NIP","197406152005011006"]
[null,"PANGKAT","Pembina Utama Muda"]
[null,"GOL. RUANG","IV/c"]
[null,"JABATAN","Guru Ahli Madya","Kepala"]
[null,"UNIT KERJA","Kantor Kementerian Agama Kabupaten Tasikmalaya (PMA 19 Tahun 2019) "]
[]
[null,"DATA PEGAWAI NEGERI SIPIL YANG DINILAI"]
[null,"NAMA","ARIEF PRIBADI, S.Si."]
[null,"NIP","198603112020121005"]
[null,"PANGKAT","Penata Muda"]
[null,"GOL. RUANG","III/a"]
[null,"JABATAN","Guru Ahli Pertama"]
[null,"UNIT KERJA","Kantor Kementerian Agama Kabupaten Tasikmalaya",null,null,null,null,null,null,"APLIKASI LAPORAN KINERJA"]
[null,null,null,null,null,null,null,null,null,null,null,null,null,"versi 12.01.26 by AP_11"]
[null,"INSTANSI","MAN 4 Tasikmalaya",null,null,null,null,null,null,null,null,null,null,"082140206782"]
[null,"TANGGAL",31,{"$f":"CONCATENATE(C19,\" \",C20,\" \",C21)","v":"31 Januari 2026"}]
[null,"BULAN","Januari",{"$f":"UPPER(C20)","v":"JANUARI"}]
[null,"TAHUN",2026]
[null,"GRADE",8,null,null,"Keterangan :"]
[null,"TUKIN",3319000,null,null,null,null,"wajib diisi oleh ASN"]
[null,"NOMOR URUT","21"]
[]
[null,"Januari"]
[null,"Februari"]
[null,"Maret"]
[null,"April"]
[null,"Mei"]
{"$rows_left_out":8}
{"sheet":"KEGIATAN","index":1,"n_rows":107,"n_cols":13,"rows_kept":107,"cut":false,"hidden":false,"merged":[[37,6,37,7],[38,6,38,7]]}
[null,"Petunjuk Pengisian:",null,null,null,null,"Petunjuk Pengisian:"]
[null,"a.","Ketik Kolom Kegiatan dengan Kegiatan Bulanan",null,null,null,"a.","Copy kegiatan bulanan dari kolom kegiatan (kolom berwarna kuning)"]
[null,"b.","Ketik Kolom Pekerjaan dengan Kegiatan Harian",null,null,null,"b.","Paste value (jangan mengetik manual)"]
[null,null,null,null,null,null,"c.","Jika kegiatan bulanan tidak terdapat pada sheet Lampiran, maka harus dicopy-paste"]
[null,null,null,null,null,null,null,"juga di menu Lampiran, dan Kegiatan Tahunan diketik manual (perhatikan Permenpan RB"]
[null,null,null,null,null,null,null,"No. 16 Tahun 2009)"]
[null,"No","Kegiatan","Pekerjaan","Tanggal",null,"No","Kegiatan Bulanan","Realisasi"]
[null,1,"Mengikuti upacara bendera","Melaksanakan apel pagi hari senin","2025-07-14",null,1,{"$f":"LAMPIRAN!O3","v":"Merencanakan dan melaksanakan pembelajaran"},{"$f":"COUNTIF($C$8:$C$107,H8)","v":0}]
[null,2,null,null,null,null,2,{"$f":"LAMPIRAN!O4","v":"Mengevaluasi dan menilai hasil pembelajaran"},{"$f":"COUNTIF($C$8:$C$107,H9)","v":0}]
[null,3,null,null,null,null,3,{"$f":"LAMPIRAN!O5","v":"Menganalisis hasil pembelajaran"},0]
[null,4,null,null,null,null,4,{"$f":"LAMPIRAN!O6","v":"Melaksanakan tindak lanjut hasil pembelajaran"},0]
[null,5,null,null,null,null,5,{"$f":"LAMPIRAN!O7","v":"Menjadi Kepala Madrasah"},0]
[null,6,null,null,null,null,6,{"$f":"LAMPIRAN!O8","v":"Menjadi Wakil Kepala Madrasah"},0]
[null,7,null,null,null,null,7,{"$f":"LAMPIRAN!O9","v":"Menjadi kepala perpustakaan"},0]
[null,8,null,null,null,null,8,{"$f":"LAMPIRAN!O10","v":"Menjadi kepala laboratorium"},0]
[null,9,null,null,null,null,9,{"$f":"LAMPIRAN!O11","v":"Menjadi wali kelas"},0]
[null,10,null,null,null,null,10,{"$f":"LAMPIRAN!O12","v":"Membimbing guru pemula dalam program induksi"},0]
[null,11,null,null,null,null,11,{"$f":"LAMPIRAN!O13","v":"Membimbing siswa dalam kegiatan ekstrakurikuler"},0]
[null,12,null,null,null,null,12,{"$f":"LAMPIRAN!O14","v":"Menjadi pembimbing pada penyusunan publikasi ilmiah dan karya inovatif"},0,null,null,"OK","CEK"]
[null,13,null,null,null,null,13,{"$f":"LAMPIRAN!O15","v":"Mengikuti diklat fungsional"},0]
[null,14,null,null,null,null,14,{"$f":"LAMPIRAN!O16","v":"Kegiatan kolektif guru yang meningkatkan kompetensi dan/atau keprofesian guru"},0]
[null,15,null,null,null,null,15,{"$f":"LAMPIRAN!O17","v":"Presentasi pada forum ilmiah"},0]
[null,16,null,null,null,null,16,{"$f":"LAMPIRAN!O18","v":"Melaksanakan publikasi ilmiah hasil penelitian atau gagasan ilmu pada bidang pendidikan formal"},0]
[null,17,null,null,null,null,17,{"$f":"LAMPIRAN!O19","v":"Melaksanakan publikasi buku teks pelajaran, buku pengayaan dan pedoman Guru"},0]
[null,18,null,null,null,null,18,{"$f":"LAMPIRAN!O20","v":"Menemukan teknologi tepat guna"},0]
[null,19,null,null,null,null,19,{"$f":"LAMPIRAN!O21","v":"Menemukan / menciptakan karya seni"},0]
[null,20,null,null,null,null,20,{"$f":"LAMPIRAN!O22","v":"Membuat / modifikasi alat pelajaran / peraga / praktikum"},0]
[null,21,null,null,null,null,21,{"$f":"LAMPIRAN!O23","v":"Mengikuti Pengembangan Penyusunan Standar, Pedoman, Soal dan sejenisnya"},0]
[null,22,null,null,null,null,22,{"$f":"LAMPIRAN!O24","v":"Sebagai pengawas ujian penilaian dan evaluasi terhadap proses dan hasil belajar tingkat madrasah"},0]
[null,23,null,null,null,null,23,{"$f":"LAMPIRAN!O25","v":"Sebagai pengawas ujian penilaian dan evaluasi terhadap proses dan hasil belajar tingkat nasional"},0]
{"$rows_left_out":78}
{"sheet":"LAMPIRAN","index":2,"n_rows":57,"n_cols":18,"rows_kept":57,"cut":false,"hidden":false,"merged":[]}
[]
[null,null,null,null,null,null,null,null,null,null,null,null,null,"Kode","Kegiatan Bulanan","Kode","Kegiatan Tahunan"]
[null,null,null,null,null,null,null,null,null,null,null,null,null,"1.1.1","Merencanakan dan melaksanakan pembelajaran","2.1","Melaksanakan proses pembelajaran",0]
[null,null,null,null,null,null,null,null,null,null,null,null,null,"1.1.2","Mengevaluasi dan menilai hasil pembelajaran","2.1","Melaksanakan proses pembelajaran",0]
[null,null,null,null,null,null,null,null,null,null,null,null,null,"1.1.3","Menganalisis hasil pembelajaran","2.1","Melaksanakan proses pembelajaran",0]
[null,null,null,null,null,null,null,null,null,null,null,null,null,"1.1.4","Melaksanakan tindak lanjut hasil pembelajaran","2.1","Melaksanakan proses pembelajaran",0]
[null,null,null,null,null,null,null,null,null,null,null,null,null,"3.1","Menjadi Kepala Madrasah","2.3","Melaksanakan tugas lain yang relevan dengan fungsi madrasah",0]
[null,null,null,null,null,null,null,null,null,null,null,null,null,"3.2","Menjadi Wakil Kepala Madrasah","2.3","Melaksanakan tugas lain yang relevan dengan fungsi madrasah",0]
[null,null,null,null,null,null,null,null,null,null,null,null,null,"3.4","Menjadi kepala perpustakaan","2.3","Melaksanakan tugas lain yang relevan dengan fungsi madrasah",0]
[null,null,null,null,null,null,null,null,null,null,null,null,null,"3.5","Menjadi kepala laboratorium","2.3","Melaksanakan tugas lain yang relevan dengan fungsi madrasah",0]
[null,null,null,null,null,null,null,null,null,null,null,null,null,"3.7","Menjadi wali kelas","2.3","Melaksanakan tugas lain yang relevan dengan fungsi madrasah",0]
[null,null,null,null,null,null,null,null,null,null,null,null,null,"3.10","Membimbing guru pemula dalam program induksi","2.3","Melaksanakan tugas lain yang relevan dengan fungsi madrasah",0]
[null,null,null,null,null,null,null,null,null,null,null,null,null,"3.11","Membimbing siswa dalam kegiatan ekstrakurikuler","2.3","Melaksanakan tugas lain yang relevan dengan fungsi madrasah",0]
[null,null,null,null,null,null,null,null,null,null,null,null,null,"3.12","Menjadi pembimbing pada penyusunan publikasi ilmiah dan karya inovatif","2.3","Melaksanakan tugas lain yang relevan dengan fungsi madrasah",0]
[null,null,null,null,null,null,null,null,null,null,null,null,null,"1.1","Mengikuti diklat fungsional","3.1","Melaksanakan pengembangan diri",0]
[null,null,null,null,null,null,null,null,null,null,null,null,null,"1.2","Kegiatan kolektif guru yang meningkatkan kompetensi dan/atau keprofesian guru","3.1","Melaksanakan pengembangan diri",0]
[null,null,null,null,null,null,null,null,null,null,null,null,null,"2.1","Presentasi pada forum ilmiah","3.2","Melaksanakan Publikasi Ilmiah",0]
[null,null,null,null,null,null,null,null,null,null,null,null,null,"2.2","Melaksanakan publikasi ilmiah hasil penelitian atau gagasan ilmu pada bidang pendidikan formal","3.2","Melaksanakan Publikasi Ilmiah",0]
[null,null,null,null,null,null,null,null,null,null,null,null,null,"2.3","Melaksanakan publikasi buku teks pelajaran, buku pengayaan dan pedoman Guru","3.2","Melaksanakan Publikasi Ilmiah",0]
[null,null,null,null,null,null,null,null,null,null,null,null,null,"3.1","Menemukan teknologi tepat guna","3.3","Melaksanakan Karya Inovatif",0]
[null,null,null,null,null,null,null,null,null,null,null,null,null,"3.2","Menemukan / menciptakan karya seni","3.3","Melaksanakan Karya Inovatif",0]
[null,null,null,null,null,null,null,null,null,null,null,null,null,"3.3","Membuat / modifikasi alat pelajaran / peraga / praktikum","3.3","Melaksanakan Karya Inovatif",0]
[null,null,null,null,null,null,null,null,null,null,null,null,null,"3.4","Mengikuti Pengembangan Penyusunan Standar, Pedoman, Soal dan sejenisnya","3.3","Melaksanakan Karya Inovatif",0]
[null,null,null,null,null,null,null,null,null,null,null,null,null,"b.1","Sebagai pengawas ujian penilaian dan evaluasi terhadap proses dan hasil belajar tingkat madrasah",2,"Melaksanakan kegiatan yang mendukung tugas guru",0]
[null,null,null,null,null,null,null,null,null,null,null,null,null,"b.2","Sebagai pengawas ujian penilaian dan evaluasi terhadap proses dan hasil belajar tingkat nasional",2,"Melaksanakan kegiatan yang mendukung tugas guru",0]
[null,null,null,null,null,null,null,null,null,null,null,null,null,null,"Mengikuti upacara bendera",null,"Mengikuti upacara bendera",0]
[null,null,null,null,null,null,null,null,null,null,null,null,null,null,null,null,null,0]
[null,null,null,null,null,null,null,null,null,null,null,null,null,null,null,null,null,0]
[null,null,null,null,null,null,null,null,null,null,null,null,null,null,null,null,null,0]
[null,null,null,null,null,null,null,null,null,null,null,null,null,null,null,null,null,0]
{"$rows_left_out":28}
{"sheet":"COVER","index":3,"n_rows":23,"n_cols":9,"rows_kept":23,"cut":false,"hidden":false,"merged":[[12,1,12,6],[0,1,0,8],[1,1,1,8],[2,1,2,8],[3,1,3,8],[6,1,6,3],[6,5,6,8],[7,1,7,3],[7,5,7,7],[8,1,8,3],[8,5,8,7],[9,1,9,3],[9,5,9,7],[20,1,20,7],[14,7,14,8],[15,7,15,8],[17,7,17,8],[18,7,18,8],[14,2,14,6],[15,2,15,6],[17,2,17,6],[18,2,18,6],[16,7,16,8]]}
[null,"LAPORAN DAFTAR HADIR & LAPORAN KINERJA"]
[null,"BULANAN DAN HARIAN"]
[null,{"$f":"\"BULAN\"&\" \"&DATA!D20","v":"BULAN JANUARI"}]
[null,{"$f":"CONCATENATE(\"TAHUN\",\" \",DATA!C21)","v":"TAHUN 2026"}]
[]
[]
[null,"NAMA",null,null,":",{"$f":"DATA!C11","v":"ARIEF PRIBADI, S.Si."}]
[null,"NIP",null,null,":",{"$f":"DATA!C12","v":"198603112020121005"}]
[null,"UNIT KERJA",null,null,":","MAN 4 Tasikmalaya"]
[null,"NOMOR URUT",null,null,":",{"$f":"DATA!C24","v":"21"}]
[]
[]
[null,"Ceklist Kelengkapan Berkas :"]
[]
[null,"NO","KELENGKAPAN",null,null,null,null,"Keterangan"]
[null,1,"Print Out Daftar hadir (Absensi Online Kementerian Agama)",null,null,null,null,"Ada / Tidak *)"]
[null,2,"Print Out Potongan Tunjangan Kinerja (Tukin)",null,null,null,null,"Ada / Tidak *)"]
[null,3,"Laporan Kinerja Bulanan ( LKB ) dan Laporan Kinerja Harian ( LKH ) dari Aplikasi Pusaka",null,null,null,null,"Ada / Tidak *)"]
[null,4,"Print Out Kelengkapan ( Surat Tugas / Cuti / Keterangan Sakit /Surat Keterangan Lainnya ) jika ada",null,null,null,null,"Ada / Tidak *)"]
[]
[null,"* diisi Oleh Petugas / Verifikator Kelengkapan Daftar Hadir"]
[]
[null,null,null,null,null,null,null,null,{"$f":"HARIAN!E112","v":"versi 12.01.26 by AP_11"}]

{"sheet":"BULANAN","index":4,"n_rows":56,"n_cols":11,"rows_kept":56,"cut":false,"hidden":false,"merged":[[40,7,40,8],[41,7,41,8],[42,7,42,8],[43,7,43,8],[44,7,44,8],[40,4,40,6],[41,4,41,6],[42,4,42,6],[43,4,43,6],[44,4,44,6],[28,4,28,6],[29,4,29,6],[30,4,30,6],[31,4,31,6],[40,2,40,3],[41,2,41,3],[42,2,42,3],[43,2,43,3],[44,2,44,3],[35,2,35,3],[36,2,36,3],[37,2,37,3],[38,2,38,3],[39,2,39,3],[30,2,30,3],[31,2,31,3],[32,2,32,3],[33,2,33,3],[34,2,34,3],[30,7,30,8],[31,7,31,8],[37,4,37,6],[38,4,38,6],[39,4,39,6],[32,4,32,6],[33,4,33,6],[34,4,34,6],[35,4,35,6],[36,4,36,6],[37,7,37,8],[38,7,38,8],[39,7,39,8],[32,7,32,8],[33,7,33,8],[34,7,34,8],[35,7,35,8],[36,7,36,8],[48,7,48,9],[17,2,17,3],[18,2,18,3],[19,2,19,3],[20,2,20,3],[21,2,21,3],[22,2,22,3],[23,2,23,3],[24,2,24,3],[25,2,25,3],[26,2,26,3],[17,4,17,6],[18,4,18,6],[19,4,19,6],[20,4,20,6],[21,4,21,6],[45,1,45,9],[46,1,46,9],[25,7,25,8],[27,2,27,3],[28,2,28,3],[29,2,29,3],[17,7,17,8],[18,7,18,8],[21,7,21,8],[22,7,22,8],[23,7,23,8],[24,7,24,8],[22,4,22,6],[23,4,23,6],[24,4,24,6],[25,4,25,6],[26,4,26,6],[27,7,27,8],[28,7,28,8],[29,7,29,8],[27,4,27,6],[2,4,2,10],[3,4,3,10],[10,3,11,4],[10,7,11,10],[12,3,14,4],[12,7,14,10],[7,7,7,10],[8,7,8,10],[9,7,9,10],[6,2,6,4],[6,6,6,10],[7,3,7,4],[8,3,8,4],[9,3,9,4],[19,7,19,8],[20,7,20,8],[16,2,16,3],[16,4,16,6],[16,7,16,8],[26,7,26,8]]}
[]
[]
[null,null,null,null,"LAPORAN BULANAN KINERJA"]
[null,null,null,null,{"$f":"CONCATENATE(DATA!C20,\" \",DATA!C21)","v":"Januari 2026"}]
[]
[]
[null,"No","I. Pejabat Penilai",null,null,"No","II. Pegawai Negeri Sipil yang Dinilai"]
[null,1,"NAMA",{"$f":"DATA!C3","v":"H. ENJANG, S.Ag., M.Pd.I."},null,1,"NAMA",{"$f":"DATA!C11","v":"ARIEF PRIBADI, S.Si."}]
[null,2,"NIP",{"$f":"DATA!C4","v":"197406152005011006"},null,2,"NIP",{"$f":"DATA!C12","v":"198603112020121005"}]
[null,3,"Pangkat - Gol Ruang",{"$f":"CONCATENATE(DATA!C5,\" \",\"-\",\" \",DATA!C6)","v":"Pembina Utama Muda - IV/c"},null,3,"Pangkat - Gol Ruang",{"$f":"CONCATENATE(DATA!C13,\" \",\"-\",\" \",DATA!C14)","v":"Penata Muda - III/a"}]
[null,4,"Jabatan",{"$f":"CONCATENATE(DATA!C7,\" \",\"/\",\" \",DATA!D7,\" \",DATA!C18)","v":"Guru Ahli Madya / Kepala MAN 4 Tasikmalaya"},null,4,"Jabatan",{"$f":"CONCATENATE(DATA!C15,\" \",DATA!C18)","v":"Guru Ahli Pertama MAN 4 Tasikmalaya"}]
[]
[null,5,"Unit Kerja",{"$f":"DATA!C8","v":"Kantor Kementerian Agama Kabupaten Tasikmalaya (PMA 19 Tahun 2019) "},null,5,"Unit Kerja",{"$f":"DATA!C16","v":"Kantor Kementerian Agama Kabupaten Tasikmalaya"}]
[]
[]
[]
[null,"No","Kegiatan Bulanan",null,"Kegiatan Tahunan",null,null,"Target",null,"Realisasi","Hasil"]
[null,null,{"$f":"LAMPIRAN!O3","v":"Merencanakan dan melaksanakan pembelajaran"},null,{"$f":"IFERROR(VLOOKUP(C18,LAMPIRAN!$O$3:$Q$57,3,0),0)","v":"Melaksanakan proses pembelajaran"},null,null,{"$f":"J18","v":0},null,{"$f":"KEGIATAN!I8","v":0},{"$f":"IFERROR(J18/H18,0)","v":0}]
[null,null,{"$f":"LAMPIRAN!O4","v":"Mengevaluasi dan menilai hasil pembelajaran"},null,{"$f":"IFERROR(VLOOKUP(C19,LAMPIRAN!$O$3:$Q$57,3,0),0)","v":"Melaksanakan proses pembelajaran"},null,null,{"$f":"J19","v":0},null,{"$f":"KEGIATAN!I9","v":0},0]
[null,null,{"$f":"LAMPIRAN!O5","v":"Menganalisis hasil pembelajaran"},null,{"$f":"IFERROR(VLOOKUP(C20,LAMPIRAN!$O$3:$Q$57,3,0),0)","v":"Melaksanakan proses pembelajaran"},null,null,0,null,{"$f":"KEGIATAN!I10","v":0},0]
[null,null,{"$f":"LAMPIRAN!O6","v":"Melaksanakan tindak lanjut hasil pembelajaran"},null,{"$f":"IFERROR(VLOOKUP(C21,LAMPIRAN!$O$3:$Q$57,3,0),0)","v":"Melaksanakan proses pembelajaran"},null,null,0,null,{"$f":"KEGIATAN!I11","v":0},0]
[null,null,{"$f":"LAMPIRAN!O7","v":"Menjadi Kepala Madrasah"},null,{"$f":"IFERROR(VLOOKUP(C22,LAMPIRAN!$O$3:$Q$57,3,0),0)","v":"Melaksanakan tugas lain yang relevan dengan fungsi madrasah"},null,null,0,null,{"$f":"KEGIATAN!I12","v":0},0]
[null,null,{"$f":"LAMPIRAN!O8","v":"Menjadi Wakil Kepala Madrasah"},null,{"$f":"IFERROR(VLOOKUP(C23,LAMPIRAN!$O$3:$Q$57,3,0),0)","v":"Melaksanakan tugas lain yang relevan dengan fungsi madrasah"},null,null,0,null,{"$f":"KEGIATAN!I13","v":0},0]
[null,null,{"$f":"LAMPIRAN!O9","v":"Menjadi kepala perpustakaan"},null,{"$f":"IFERROR(VLOOKUP(C24,LAMPIRAN!$O$3:$Q$57,3,0),0)","v":"Melaksanakan tugas lain yang relevan dengan fungsi madrasah"},null,null,0,null,{"$f":"KEGIATAN!I14","v":0},0]
[null,null,{"$f":"LAMPIRAN!O10","v":"Menjadi kepala laboratorium"},null,{"$f":"IFERROR(VLOOKUP(C25,LAMPIRAN!$O$3:$Q$57,3,0),0)","v":"Melaksanakan tugas lain yang relevan dengan fungsi madrasah"},null,null,0,null,{"$f":"KEGIATAN!I15","v":0},0]
[null,null,{"$f":"LAMPIRAN!O11","v":"Menjadi wali kelas"},null,{"$f":"IFERROR(VLOOKUP(C26,LAMPIRAN!$O$3:$Q$57,3,0),0)","v":"Melaksanakan tugas lain yang relevan dengan fungsi madrasah"},null,null,0,null,{"$f":"KEGIATAN!I16","v":0},0]
[null,null,{"$f":"LAMPIRAN!O12","v":"Membimbing guru pemula dalam program induksi"},null,{"$f":"IFERROR(VLOOKUP(C27,LAMPIRAN!$O$3:$Q$57,3,0),0)","v":"Melaksanakan tugas lain yang relevan dengan fungsi madrasah"},null,null,{"$f":"J27","v":0},null,{"$f":"KEGIATAN!I17","v":0},0]
[null,null,{"$f":"LAMPIRAN!O13","v":"Membimbing siswa dalam kegiatan ekstrakurikuler"},null,{"$f":"IFERROR(VLOOKUP(C28,LAMPIRAN!$O$3:$Q$57,3,0),0)","v":"Melaksanakan tugas lain yang relevan dengan fungsi madrasah"},null,null,{"$f":"J28","v":0},null,{"$f":"KEGIATAN!I18","v":0},0]
[null,null,{"$f":"LAMPIRAN!O14","v":"Menjadi pembimbing pada penyusunan publikasi ilmiah dan karya inovatif"},null,{"$f":"IFERROR(VLOOKUP(C29,LAMPIRAN!$O$3:$Q$57,3,0),0)","v":"Melaksanakan tugas lain yang relevan dengan fungsi madrasah"},null,null,0,null,{"$f":"KEGIATAN!I19","v":0},0]
[null,null,{"$f":"LAMPIRAN!O15","v":"Mengikuti diklat fungsional"},null,{"$f":"IFERROR(VLOOKUP(C30,LAMPIRAN!$O$3:$Q$57,3,0),0)","v":"Melaksanakan pengembangan diri"},null,null,0,null,{"$f":"KEGIATAN!I20","v":0},0]
{"$rows_left_out":27}
{"sheet":"HARIAN","index":5,"n_rows":120,"n_cols":7,"rows_kept":120,"cut":false,"hidden":false,"merged":[[112,3,112,4],[113,3,113,4],[118,3,118,4],[119,3,119,4],[4,3,4,4],[5,3,5,4],[6,3,6,4],[7,3,7,4],[8,3,8,4]]}
[]
[null,"LAPORAN KEGIATAN HARIAN"]
[null,{"$f":"BULANAN!E4","v":"Januari 2026"}]
[]
[null,1,"NAMA",{"$f":"CONCATENATE(\":\",\" \",BULANAN!H8)","v":": ARIEF PRIBADI, S.Si."}]
[null,2,"NIP",{"$f":"CONCATENATE(\":\",\" \",BULANAN!H9)","v":": 198603112020121005"}]
[null,3,"Pangkat-Gol",{"$f":"CONCATENATE(\":\",\" \",BULANAN!H10)","v":": Penata Muda - III/a"}]
[null,4,"Jabatan",{"$f":"CONCATENATE(\":\",\" \",BULANAN!H11)","v":": Guru Ahli Pertama MAN 4 Tasikmalaya"}]
[null,5,"Unit Kerja",{"$f":"CONCATENATE(\":\",\" \",BULANAN!H13)","v":": Kantor Kementerian Agama Kabupaten Tasikmalaya"}]
[]
[null,"No","Kegiatan","Pekerjaan","Tanggal"]
[null,null,{"$f":"KEGIATAN!C8","v":"Mengikuti upacara bendera"},{"$f":"KEGIATAN!D8","v":"Melaksanakan apel pagi hari senin"},{"$f":"KEGIATAN!E8","v":"2025-07-14"},null,{"$f":"COUNTA(KEGIATAN!C8)","v":1}]
[null,null,{"$f":"KEGIATAN!C9","v":0},{"$f":"KEGIATAN!D9","v":0},{"$f":"KEGIATAN!E9","v":"00:00:00"},null,{"$f":"COUNTA(KEGIATAN!C9)","v":0}]
[null,null,{"$f":"KEGIATAN!C10","v":0},{"$f":"KEGIATAN!D10","v":0},{"$f":"KEGIATAN!E10","v":"00:00:00"},null,{"$f":"COUNTA(KEGIATAN!C10)","v":0}]
[null,null,{"$f":"KEGIATAN!C11","v":0},{"$f":"KEGIATAN!D11","v":0},{"$f":"KEGIATAN!E11","v":"00:00:00"},null,{"$f":"COUNTA(KEGIATAN!C11)","v":0}]
[null,null,{"$f":"KEGIATAN!C12","v":0},{"$f":"KEGIATAN!D12","v":0},{"$f":"KEGIATAN!E12","v":"00:00:00"},null,{"$f":"COUNTA(KEGIATAN!C12)","v":0}]
[null,null,{"$f":"KEGIATAN!C13","v":0},{"$f":"KEGIATAN!D13","v":0},{"$f":"KEGIATAN!E13","v":"00:00:00"},null,{"$f":"COUNTA(KEGIATAN!C13)","v":0}]
[null,null,{"$f":"KEGIATAN!C14","v":0},{"$f":"KEGIATAN!D14","v":0},{"$f":"KEGIATAN!E14","v":"00:00:00"},null,{"$f":"COUNTA(KEGIATAN!C14)","v":0}]
[null,null,{"$f":"KEGIATAN!C15","v":0},{"$f":"KEGIATAN!D15","v":0},{"$f":"KEGIATAN!E15","v":"00:00:00"},null,{"$f":"COUNTA(KEGIATAN!C15)","v":0}]
[null,null,{"$f":"KEGIATAN!C16","v":0},{"$f":"KEGIATAN!D16","v":0},{"$f":"KEGIATAN!E16","v":"00:00:00"},null,{"$f":"COUNTA(KEGIATAN!C16)","v":0}]
[null,null,{"$f":"KEGIATAN!C17","v":0},{"$f":"KEGIATAN!D17","v":0},{"$f":"KEGIATAN!E17","v":"00:00:00"},null,{"$f":"COUNTA(KEGIATAN!C17)","v":0}]
[null,null,{"$f":"KEGIATAN!C18","v":0},{"$f":"KEGIATAN!D18","v":0},{"$f":"KEGIATAN!E18","v":"00:00:00"},null,{"$f":"COUNTA(KEGIATAN!C18)","v":0}]
[null,null,{"$f":"KEGIATAN!C19","v":0},{"$f":"KEGIATAN!D19","v":0},{"$f":"KEGIATAN!E19","v":"00:00:00"},null,{"$f":"COUNTA(KEGIATAN!C19)","v":0}]
[null,null,{"$f":"KEGIATAN!C20","v":0},{"$f":"KEGIATAN!D20","v":0},{"$f":"KEGIATAN!E20","v":"00:00:00"},null,{"$f":"COUNTA(KEGIATAN!C20)","v":0}]
[null,null,{"$f":"KEGIATAN!C21","v":0},{"$f":"KEGIATAN!D21","v":0},{"$f":"KEGIATAN!E21","v":"00:00:00"},null,{"$f":"COUNTA(KEGIATAN!C21)","v":0}]
[null,null,{"$f":"KEGIATAN!C22","v":0},{"$f":"KEGIATAN!D22","v":0},{"$f":"KEGIATAN!E22","v":"00:00:00"},null,{"$f":"COUNTA(KEGIATAN!C22)","v":0}]
[null,null,{"$f":"KEGIATAN!C23","v":0},{"$f":"KEGIATAN!D23","v":0},{"$f":"KEGIATAN!E23","v":"00:00:00"},null,{"$f":"COUNTA(KEGIATAN!C23)","v":0}]
[null,null,{"$f":"KEGIATAN!C24","v":0},{"$f":"KEGIATAN!D24","v":0},{"$f":"KEGIATAN!E24","v":"00:00:00"},null,{"$f":"COUNTA(KEGIATAN!C24)","v":0}]
[null,null,{"$f":"KEGIATAN!C25","v":0},{"$f":"KEGIATAN!D25","v":0},{"$f":"KEGIATAN!E25","v":"00:00:00"},null,{"$f":"COUNTA(KEGIATAN!C25)","v":0}]
[null,null,{"$f":"KEGIATAN!C26","v":0},{"$f":"KEGIATAN!D26","v":0},{"$f":"KEGIATAN!E26","v":"00:00:00"},null,{"$f":"COUNTA(KEGIATAN!C26)","v":0}]
{"$rows_left_out":90}